BDBM50303984 CHEMBL565379::Ethyl 2-Methyl-2-(4-((4-methyl-2-propyl-1H-benzo[d]imidazol-1-yl)methyl)-phenoxy)-propanoate
SMILES CCCc1nc2c(C)cccc2n1Cc1ccc(OC(C)(C)C(=O)OCC)cc1
InChI Key InChIKey=BAPKLCUYMABXMZ-UHFFFAOYSA-N
Data  1 KI
  Tab Delimited (TSV)   2D SDfile   Computed 3D by Vconf -m prep SDfile
Find this compound or compounds like it in BindingDB:
Activity Spreadsheet -- Enzyme Inhibition Constant Data from BindingDB
Found 1 hit for monomerid = 50303984
TargetType-1 angiotensin II receptor A(RAT)
The University Of Mississippi
Curated by ChEMBL
LigandPNGBDBM50303984(CHEMBL565379 | Ethyl 2-Methyl-2-(4-((4-methyl-2-pr...)
Affinity DataKi: >1.00E+4nM. Assay description: Displacement of [125I]SI-Ang2 from AT1 receptor in Sprague-Dawley rat liver membrane
In DepthDetails ArticlePubMed