BDBM50304612 2-(5-((3-(4-(ethylthio)phenyl)-1-phenyl-1H-pyrazol-4-yl)methylene)-4-oxo-2-thioxothiazolidin-3-yl)acetic acid::CHEMBL596586
SMILES CCSc1ccc(cc1)-c1nn(cc1\C=C1\SC(=S)N(CC(O)=O)C1=O)-c1ccccc1
InChI Key InChIKey=LRDWWFDWWWFJIH-XDHOZWIPSA-N
Data  1 IC50
  Tab Delimited (TSV)   2D SDfile   Computed 3D by Vconf -m prep SDfile
Find this compound or compounds like it in BindingDB:
Activity Spreadsheet -- Enzyme Inhibition Constant Data from BindingDB
Found 1 hit for monomerid = 50304612
TargetHypoxia-inducible factor 1-alpha inhibitor(Homo sapiens (Human))
Sejong University
Curated by ChEMBL
LigandPNGBDBM50304612(2-(5-((3-(4-(ethylthio)phenyl)-1-phenyl-1H-pyrazol...)
Affinity DataIC50:  3.62E+4nM. Assay description: Inhibition of human recombinant FIH1
In DepthDetails ArticlePubMed