BDBM50304616 6-(2-methoxystyryl)-3-(quinolin-2-yl)thiazolo[2,3-c][1,2,4]triazole::CHEMBL606040
SMILES COc1ccccc1\C=C\c1cn2c(nnc2s1)-c1ccc2ccccc2n1
InChI Key InChIKey=LEILYYNQIOHZQI-ZRDIBKRKSA-N
Data  1 IC50
  Tab Delimited (TSV)   2D SDfile   Computed 3D by Vconf -m prep SDfile
Find this compound or compounds like it in BindingDB:
Activity Spreadsheet -- Enzyme Inhibition Constant Data from BindingDB
Found 1 hit for monomerid = 50304616
TargetHypoxia-inducible factor 1-alpha inhibitor(Homo sapiens (Human))
Sejong University
Curated by ChEMBL
LigandPNGBDBM50304616(6-(2-methoxystyryl)-3-(quinolin-2-yl)thiazolo[2,3-...)
Affinity DataIC50:  4.75E+4nM. Assay description: Inhibition of human recombinant FIH1
In DepthDetails ArticlePubMed