BDBM50304788 CHEMBL594160::methyl 4-(3-chloro-4-methoxybenzylamino)-8-(2-hydroxyethyl)-7-methoxyquinazolin-6-yl(methyl)carbamate
SMILES COC(=O)N(C)c1cc2c(NCc3ccc(OC)c(Cl)c3)ncnc2c(CCO)c1OC
InChI Key InChIKey=HHYZCHIATOFILW-UHFFFAOYSA-N
Data  2 IC50
  Tab Delimited (TSV)   2D SDfile   Computed 3D by Vconf -m prep SDfile
Find this compound or compounds like it in BindingDB:
Activity Spreadsheet -- Enzyme Inhibition Constant Data from BindingDB
Found 2 hits for monomerid = 50304788
TargetRod cGMP-specific 3',5'-cyclic phosphodiesterase subunit alpha(Bos taurus (Bovine))
Chong Kun Dang Research Institute
Curated by ChEMBL
LigandPNGBDBM50304788(CHEMBL594160 | methyl 4-(3-chloro-4-methoxybenzyla...)
Affinity DataIC50:  140nM. Assay description: Inhibition of bovine retina PDE6
In DepthDetails ArticlePubMed
TargetcGMP-specific 3',5'-cyclic phosphodiesterase(Bos taurus)
Chong Kun Dang Research Institute
Curated by ChEMBL
LigandPNGBDBM50304788(CHEMBL594160 | methyl 4-(3-chloro-4-methoxybenzyla...)
Affinity DataIC50:  0.600nM. Assay description: Inhibition of bovine platelet PDE5
In DepthDetails ArticlePubMed