BDBM50305868 5-methyl-3-phenyl-6-p-tolylisoxazolo[4,5-c]pyridin-4(5H)-one::CHEMBL595825
SMILES Cc1ccc(cc1)-c1cc2onc(-c3ccccc3)c2c(=O)n1C
InChI Key InChIKey=BESWQYUOFDGBAT-UHFFFAOYSA-N
Data  1 IC50
  Tab Delimited (TSV)   2D SDfile   Computed 3D by Vconf -m prep SDfile
Find this compound or compounds like it in BindingDB:
Activity Spreadsheet -- Enzyme Inhibition Constant Data from BindingDB
Found 1 hit for monomerid = 50305868
TargetMetabotropic glutamate receptor 7(Rattus norvegicus (Rat))
Banyu Tsukuba Research Institute
Curated by ChEMBL
LigandPNGBDBM50305868(5-methyl-3-phenyl-6-p-tolylisoxazolo[4,5-c]pyridin...)
Affinity DataIC50:  51nM. Assay description: Antagonist activity at rat mGluR7 expressed in CHO cells assessed as inhibition of LAP-induced intracellular calcium mobilization by FLIPR
In DepthDetails ArticlePubMed