BDBM50306033 Cenicriviroc::TAK-652::TBR-652
SMILES CCCCOCCOc1ccc(cc1)-c1ccc2N(CC(C)C)CCC\C(=C/c2c1)C(=O)Nc1ccc(cc1)[S@@+]([O-])Cc1cncn1CCC
InChI Key InChIKey=PNDKCRDVVKJPKG-WHERJAGFSA-N
Data  3 IC50
  Tab Delimited (TSV)   2D SDfile   Computed 3D by Vconf -m prep SDfile
Find this compound or compounds like it in BindingDB:
Activity Spreadsheet -- Enzyme Inhibition Constant Data from BindingDB
Found 3 hits for monomerid = 50306033
TargetC-C chemokine receptor type 5(Mus musculus)
Nirma University
Curated by ChEMBL
LigandPNGBDBM50306033(Cenicriviroc | TAK-652 | TBR-652)
Affinity DataIC50:  0.25nM. Assay description: Displacement of [125I]-RANTES from CCR5 in mouse NIH/3T3 cells after 1 hr
In DepthDetails ArticlePubMed
TargetC-C chemokine receptor type 7(Homo sapiens (Human))
Terns Pharmaceuticals
Curated by ChEMBL
LigandPNGBDBM50306033(Cenicriviroc | TAK-652 | TBR-652)
Affinity DataIC50:  3.10nM. Assay description: Inhibition of CCR7 (unknown origin)
In DepthDetails ArticlePubMed
TargetC-C chemokine receptor type 2(Homo sapiens (Human))
Terns Pharmaceuticals
Curated by ChEMBL
LigandPNGBDBM50306033(Cenicriviroc | TAK-652 | TBR-652)
Affinity DataIC50:  5.90nM. Assay description: Inhibition of CCR2 (unknown origin)
In DepthDetails ArticlePubMed