BDBM50306414 3-Phenyl-piperidine-1-carboxylic acid adamantan-2-ylamide::CHEMBL605544
SMILES O=C(NC1C2CC3CC(C2)CC1C3)N1CCCC(C1)c1ccccc1
InChI Key InChIKey=RKMDPZGRAJLGJP-UHFFFAOYSA-N
Data  1 IC50
  Tab Delimited (TSV)   2D SDfile   Computed 3D by Vconf -m prep SDfile
Find this compound or compounds like it in BindingDB:
Activity Spreadsheet -- Enzyme Inhibition Constant Data from BindingDB
Found 1 hit for monomerid = 50306414
Target11-beta-hydroxysteroid dehydrogenase 1(Homo sapiens (Human))
Vitae Pharmaceuticals
Curated by ChEMBL
LigandPNGBDBM50306414(3-Phenyl-piperidine-1-carboxylic acid adamantan-2-...)
Affinity DataIC50:  0.800nM. Assay description: Inhibition of human recombinant 11beta-HSD1 expressed in CHO cells assessed as conversion of [3H]cortisone to [3H]cortisol by SPA
In DepthDetails ArticlePubMed