BDBM50306587 6-Fluoro-N-(6-(4-methoxytetrahydro-2H-pyran-4-yl)pyridin-3-yl)-4-oxo-8-(1,3,5-trimethyl-1H-pyrazol-4-yl)-4H-chromene-2-carboxamide::CHEMBL605785
SMILES COC1(CCOCC1)c1ccc(NC(=O)c2cc(=O)c3cc(F)cc(-c4c(C)nn(C)c4C)c3o2)cn1
InChI Key InChIKey=NWXMOGAAGJJIMH-UHFFFAOYSA-N
Data  1 KI  1 IC50
  Tab Delimited (TSV)   2D SDfile   Computed 3D by Vconf -m prep SDfile
Find this compound or compounds like it in BindingDB:
Activity Spreadsheet -- Enzyme Inhibition Constant Data from BindingDB
Found 2 hits for monomerid = 50306587
Target5-hydroxytryptamine receptor 1B(Homo sapiens (Human))
Astrazeneca Pharmaceuticals
Curated by ChEMBL
LigandPNGBDBM50306587(6-Fluoro-N-(6-(4-methoxytetrahydro-2H-pyran-4-yl)p...)
Affinity DataKi:  0.430nM. Assay description: Binding affinity to 5HT1B receptor expressed in CHO cells
In DepthDetails ArticlePubMed
TargetPotassium voltage-gated channel subfamily H member 2(Homo sapiens (Human))
Astrazeneca Pharmaceuticals
Curated by ChEMBL
LigandPNGBDBM50306587(6-Fluoro-N-(6-(4-methoxytetrahydro-2H-pyran-4-yl)p...)
Affinity DataIC50:  9.50E+4nM. Assay description: Inhibition of human ERG
In DepthDetails ArticlePubMed