BDBM50306622 1-(4-(4-(8-oxa-3-azabicyclo[3.2.1]octan-3-yl)-1-methyl-1H-pyrazolo[3,4-d]pyrimidin-6-yl)phenyl)-3-methylurea::CHEMBL601864
SMILES CNC(=O)Nc1ccc(cc1)-c1nc(N2CC3CCC(C2)O3)c2cnn(C)c2n1
InChI Key InChIKey=APYPCVRCUBVUDW-UHFFFAOYSA-N
Data  2 IC50
  Tab Delimited (TSV)   2D SDfile   Computed 3D by Vconf -m prep SDfile
Find this compound or compounds like it in BindingDB:
Activity Spreadsheet -- Enzyme Inhibition Constant Data from BindingDB
Found 2 hits for monomerid = 50306622
LigandPNGBDBM50306622(1-(4-(4-(8-oxa-3-azabicyclo[3.2.1]octan-3-yl)-1-me...)
Affinity DataIC50:  247nM. Assay description: Inhibition of PI3Kalpha
In DepthDetails ArticlePubMed
TargetSerine/threonine-protein kinase mTOR(Homo sapiens (Human))
Wyeth Research
Curated by ChEMBL
LigandPNGBDBM50306622(1-(4-(4-(8-oxa-3-azabicyclo[3.2.1]octan-3-yl)-1-me...)
Affinity DataIC50:  1.34nM. Assay description: Inhibition of mTOR
In DepthDetails ArticlePubMed