BDBM50306628 CHEMBL610630::trans-1-(4-(4-(8-oxa-3-azabicyclo[3.2.1]octan-3-yl)-1-(4-hydroxycyclohexyl)-1H-pyrazolo[3,4-d]pyrimidin-6-yl)phenyl)-3-methylurea
SMILES CNC(=O)Nc1ccc(cc1)-c1nc(N2CC3CCC(C2)O3)c2cnn([C@H]3CC[C@H](O)CC3)c2n1
InChI Key InChIKey=LQBQQAXIISEIGM-RTWGARKQSA-N
Data  2 IC50
  Tab Delimited (TSV)   2D SDfile   Computed 3D by Vconf -m prep SDfile
Find this compound or compounds like it in BindingDB:
Activity Spreadsheet -- Enzyme Inhibition Constant Data from BindingDB
Found 2 hits for monomerid = 50306628
LigandPNGBDBM50306628(CHEMBL610630 | trans-1-(4-(4-(8-oxa-3-azabicyclo[3...)
Affinity DataIC50:  882nM. Assay description: Inhibition of PI3Kalpha
In DepthDetails ArticlePubMed
TargetSerine/threonine-protein kinase mTOR(Homo sapiens (Human))
Wyeth Research
Curated by ChEMBL
LigandPNGBDBM50306628(CHEMBL610630 | trans-1-(4-(4-(8-oxa-3-azabicyclo[3...)
Affinity DataIC50:  0.240nM. Assay description: Inhibition of mTOR
In DepthDetails ArticlePubMed