BDBM50306630 CHEMBL602276::trans-1-(4-(4-(8-oxa-3-azabicyclo[3.2.1]octan-3-yl)-1-(4-methoxycyclohexyl)-1H-pyrazolo[3,4-d]pyrimidin-6-yl)phenyl)-3-methylurea
SMILES CNC(=O)Nc1ccc(cc1)-c1nc(N2CC3CCC(C2)O3)c2cnn([C@H]3CC[C@@H](CC3)OC)c2n1
InChI Key InChIKey=ZDYYEIJLRMPBFE-GOHCJOFJSA-N
Data  2 IC50
  Tab Delimited (TSV)   2D SDfile   Computed 3D by Vconf -m prep SDfile
Find this compound or compounds like it in BindingDB:
Activity Spreadsheet -- Enzyme Inhibition Constant Data from BindingDB
Found 2 hits for monomerid = 50306630
LigandPNGBDBM50306630(CHEMBL602276 | trans-1-(4-(4-(8-oxa-3-azabicyclo[3...)
Affinity DataIC50:  1.17E+3nM. Assay description: Inhibition of PI3Kalpha
In DepthDetails ArticlePubMed
TargetSerine/threonine-protein kinase mTOR(Homo sapiens (Human))
Wyeth Research
Curated by ChEMBL
LigandPNGBDBM50306630(CHEMBL602276 | trans-1-(4-(4-(8-oxa-3-azabicyclo[3...)
Affinity DataIC50:  0.380nM. Assay description: Inhibition of mTOR
In DepthDetails ArticlePubMed