BDBM50306637 1-(4-(4-(8-oxa-3-azabicyclo[3.2.1]octan-3-yl)-1-(1,4-dioxaspiro[4.5]decan-8-yl)-1H-pyrazolo[3,4-d]pyrimidin-6-yl)phenyl)-3-cyclopropylurea::CHEMBL600213
SMILES O=C(NC1CC1)Nc1ccc(cc1)-c1nc(N2CC3CCC(C2)O3)c2cnn(C3CCC4(CC3)OCCO4)c2n1
InChI Key InChIKey=PPTXHISAVZQIPE-UHFFFAOYSA-N
Data  2 IC50
  Tab Delimited (TSV)   2D SDfile   Computed 3D by Vconf -m prep SDfile
Find this compound or compounds like it in BindingDB:
Activity Spreadsheet -- Enzyme Inhibition Constant Data from BindingDB
Found 2 hits for monomerid = 50306637
LigandPNGBDBM50306637(1-(4-(4-(8-oxa-3-azabicyclo[3.2.1]octan-3-yl)-1-(1...)
Affinity DataIC50:  1.20E+4nM. Assay description: Inhibition of PI3Kalpha
In DepthDetails ArticlePubMed
TargetSerine/threonine-protein kinase mTOR(Homo sapiens (Human))
Wyeth Research
Curated by ChEMBL
LigandPNGBDBM50306637(1-(4-(4-(8-oxa-3-azabicyclo[3.2.1]octan-3-yl)-1-(1...)
Affinity DataIC50:  0.220nM. Assay description: Inhibition of mTOR
In DepthDetails ArticlePubMed