BDBM50307083 4-nitrophenyl 4-(3-phenoxybenzyl)piperazine-1-carboxylate::CHEMBL606201::US11753371, Compound JZL-195
SMILES [O-][N+](=O)c1ccc(OC(=O)N2CCN(Cc3cccc(Oc4ccccc4)c3)CC2)cc1
InChI Key InChIKey=QNYRAEKLMNDRFY-UHFFFAOYSA-N
Data  10 IC50
  Tab Delimited (TSV)   2D SDfile   Computed 3D by Vconf -m prep SDfile
Find this compound or compounds like it in BindingDB:
Activity Spreadsheet -- Enzyme Inhibition Constant Data from BindingDB
Found 10 hits for monomerid = 50307083
TargetFatty-acid amide hydrolase 1(Mus musculus (mouse))
The Scripps Research Institute
Curated by ChEMBL
LigandPNGBDBM50307083(4-nitrophenyl 4-(3-phenoxybenzyl)piperazine-1-carb...)
Affinity DataIC50:  13nM. Assay description: Inhibition of FAAH in mouse brain membrane
In DepthDetails ArticlePubMed
TargetMonoglyceride lipase(Mus musculus (mouse))
The Scripps Research Institute
Curated by ChEMBL
LigandPNGBDBM50307083(4-nitrophenyl 4-(3-phenoxybenzyl)piperazine-1-carb...)
Affinity DataIC50:  19nM. Assay description: Inhibition of MAGL in mouse brain membrane
In DepthDetails ArticlePubMed
TargetMonoacylglycerol lipase ABHD6(Mus musculus (mouse))
The Scripps Research Institute
Curated by ChEMBL
LigandPNGBDBM50307083(4-nitrophenyl 4-(3-phenoxybenzyl)piperazine-1-carb...)
Affinity DataIC50:  50nM. Assay description: Inhibition of ABHD6 in mouse brain membrane
In DepthDetails ArticlePubMed
TargetMonoglyceride lipase(Homo sapiens (Human))
China Pharmaceutical University
Curated by ChEMBL
LigandPNGBDBM50307083(4-nitrophenyl 4-(3-phenoxybenzyl)piperazine-1-carb...)
Affinity DataIC50:  205nM. Assay description: Inhibition of human recombinant MAGL pre-incubated for 5 mins before MAGL substrate addition and further incubated for 10 mins
In DepthDetails ArticlePubMed
TargetMonoglyceride lipase(Homo sapiens (Human))
China Pharmaceutical University
Curated by ChEMBL
LigandPNGBDBM50307083(4-nitrophenyl 4-(3-phenoxybenzyl)piperazine-1-carb...)
Affinity DataIC50:  4nM. Assay description: Inhibition of recombinant MAGL (unknown origin) expressed in COS7 cells assessed as blockade of substrate hydrolysis using AEA as substrate preincuba...
In DepthDetails PubMed
TargetMonoglyceride lipase(Homo sapiens (Human))
China Pharmaceutical University
Curated by ChEMBL
LigandPNGBDBM50307083(4-nitrophenyl 4-(3-phenoxybenzyl)piperazine-1-carb...)
Affinity DataIC50:  4nM. Assay description: Inhibition of human recombinant MAGL incubated for 5 mins followed by substrate addition by cayman fluorescence based multimode microplate reader ass...
In DepthDetails PubMed
TargetFatty-acid amide hydrolase 1(Homo sapiens (Human))
University Of Bari Aldo Moro
Curated by ChEMBL
LigandPNGBDBM50307083(4-nitrophenyl 4-(3-phenoxybenzyl)piperazine-1-carb...)
Affinity DataIC50:  19nM. Assay description: Inhibition of human recombinant FAAH using AMC-AA as substrate preincubated with enzyme for 10 mins followed by substrate addition for 2 hrs by fluor...
In DepthDetails PubMed
TargetFatty-acid amide hydrolase 1(Homo sapiens (Human))
University Of Bari Aldo Moro
Curated by ChEMBL
LigandPNGBDBM50307083(4-nitrophenyl 4-(3-phenoxybenzyl)piperazine-1-carb...)
Affinity DataIC50:  40nM. Assay description: FAAH inhibition assay was performed using Fatty Acid Amide Hydrolase Inhibitor Screening Assay Kit (Item #10005196), Cayman (1180 E Ellsworth Rd Ann ...
In DepthDetails US Patent
TargetFatty-acid amide hydrolase 1(Homo sapiens (Human))
University Of Bari Aldo Moro
Curated by ChEMBL
LigandPNGBDBM50307083(4-nitrophenyl 4-(3-phenoxybenzyl)piperazine-1-carb...)
Affinity DataIC50:  2nM. Assay description: Inhibition of recombinant FAAH (unknown origin) expressed in COS7 cells assessed as blockade of substrate hydrolysis using 2-AG as substrate preincub...
In DepthDetails PubMed
TargetFatty-acid amide hydrolase 1(Homo sapiens (Human))
University Of Bari Aldo Moro
Curated by ChEMBL
LigandPNGBDBM50307083(4-nitrophenyl 4-(3-phenoxybenzyl)piperazine-1-carb...)
Affinity DataIC50:  2nM. Assay description: Inhibition of recombinant human FAAH incubated for 5 mins followed by substrate addition by cayman fluorescence based multimode microplate reader ass...
In DepthDetails PubMed