BDBM50309356 6,7-dichloro-4-(4-fluoro-3-(4-(quinazolin-4-yl)piperazine-1-carbonyl)benzyl)pyrrolo[1,2-a]pyrazin-1(2H)-one::CHEMBL596713
SMILES Fc1ccc(Cc2c[nH]c(=O)c3cc(Cl)c(Cl)n23)cc1C(=O)N1CCN(CC1)c1ncnc2ccccc12
InChI Key InChIKey=RYGUYLPUSPBYMI-UHFFFAOYSA-N
Data  1 IC50
  Tab Delimited (TSV)   2D SDfile   Computed 3D by Vconf -m prep SDfile
Find this compound or compounds like it in BindingDB:
Activity Spreadsheet -- Enzyme Inhibition Constant Data from BindingDB
Found 1 hit for monomerid = 50309356
TargetPoly [ADP-ribose] polymerase 1(Homo sapiens (Human))
Irbm/Merck Research Laboratories
Curated by ChEMBL
LigandPNGBDBM50309356(6,7-dichloro-4-(4-fluoro-3-(4-(quinazolin-4-yl)pip...)
Affinity DataIC50:  1.40nM. Assay description: Inhibition of PARP1 by topcount microplate scintillation counter
In DepthDetails ArticlePubMed