BDBM50309371 4-(5-((6,7-dichloro-1-oxo-1,2-dihydropyrrolo[1,2-a]pyrazin-4-yl)methyl)-2-fluorobenzoyl)-N,N-dimethylpiperazine-1-carboxamide::CHEMBL589575
SMILES CN(C)C(=O)N1CCN(CC1)C(=O)c1cc(Cc2c[nH]c(=O)c3cc(Cl)c(Cl)n23)ccc1F
InChI Key InChIKey=IYZGMTPUQWNOER-UHFFFAOYSA-N
Data  1 IC50
  Tab Delimited (TSV)   2D SDfile   Computed 3D by Vconf -m prep SDfile
Find this compound or compounds like it in BindingDB:
Activity Spreadsheet -- Enzyme Inhibition Constant Data from BindingDB
Found 1 hit for monomerid = 50309371
TargetPoly [ADP-ribose] polymerase 1(Homo sapiens (Human))
Irbm/Merck Research Laboratories
Curated by ChEMBL
LigandPNGBDBM50309371(4-(5-((6,7-dichloro-1-oxo-1,2-dihydropyrrolo[1,2-a...)
Affinity DataIC50:  7.20nM. Assay description: Inhibition of PARP1 by topcount microplate scintillation counter
In DepthDetails ArticlePubMed