BDBM50309491 (2R,3R,4S,5S)-2-(6-(2,2-diphenylethylamino)-2-(2-(1-ethyl-1H-imidazol-4-yl)ethylamino)-9H-purin-9-yl)-5-(4-ethyl-1H-pyrazol-1-yl)tetrahydrofuran-3,4-diol::CHEMBL601731
SMILES CCc1cnn(c1)[C@H]1C[C@H]([C@H](O)[C@@H]1O)n1cnc2c(NCC(c3ccccc3)c3ccccc3)nc(NCCc3cn(CC)cn3)nc12
InChI Key InChIKey=OAXONXRZJFKHCS-GJPTZXPMSA-N
Data  1 KI
  Tab Delimited (TSV)   2D SDfile   Computed 3D by Vconf -m prep SDfile
Find this compound or compounds like it in BindingDB:
Activity Spreadsheet -- Enzyme Inhibition Constant Data from BindingDB
Found 1 hit for monomerid = 50309491
TargetAdenosine receptor A2a(Homo sapiens (Human))
Novartis Institutes For Biomedical Research
Curated by ChEMBL
LigandPNGBDBM50309491((2R,3R,4S,5S)-2-(6-(2,2-diphenylethylamino)-2-(2-(...)
Affinity DataKi:  146nM. Assay description: Displacement of [3H]NECA from human recombinant adenosine A2A receptor expressed in Sf21 cells co-expressing GalphaS2, beta4, gamma2
In DepthDetails ArticlePubMed