BDBM50309580 2-(4,6-dimethylpyrimidin-2-ylthio)-1-(3-hydroxyphenyl)ethanone::CHEMBL599967::cid_25199542
SMILES Cc1cc(C)nc(SCC(=O)c2cccc(O)c2)n1
InChI Key InChIKey=BVILRROQNWDJLL-UHFFFAOYSA-N
Data  3 IC50
  Tab Delimited (TSV)   2D SDfile   Computed 3D by Vconf -m prep SDfile
Find this compound or compounds like it in BindingDB:
Activity Spreadsheet -- Enzyme Inhibition Constant Data from BindingDB
Found 3 hits for monomerid = 50309580
TargetAlkaline phosphatase, tissue-nonspecific isozyme(Homo sapiens (Human))
Burnham Center For Chemical Genomics
Curated by PubChem BioAssay
LigandPNGBDBM50309580(2-(4,6-dimethylpyrimidin-2-ylthio)-1-(3-hydroxyphe...)
Affinity DataIC50: >1.00E+5nM. Assay description: Sanford-Burnham Center for Chemical Genomics (SBCCG) Sanford-Burnham Medical Research Institute (SBMRI, San Diego, CA) NIH Molecular Libraries Screen...
In DepthDetails PCBioAssay
TargetPhospholipase A-2-activating protein(Homo sapiens (Human))
Human Biomolecular Research Institute
Curated by ChEMBL
LigandPNGBDBM50309580(2-(4,6-dimethylpyrimidin-2-ylthio)-1-(3-hydroxyphe...)
Affinity DataIC50: >1.00E+5nM. Assay description: Inhibition of PLAP by analogous luminescence assay
In DepthDetails ArticlePubMed
TargetAlkaline phosphatase, germ cell type(Homo sapiens (Human))
Burnham Center For Chemical Genomics
Curated by PubChem BioAssay
LigandPNGBDBM50309580(2-(4,6-dimethylpyrimidin-2-ylthio)-1-(3-hydroxyphe...)
Affinity DataIC50: >1.00E+5nM. Assay description: Data Source: Sanford-Burnham Center for Chemical Genomics (SBCCG) Source Affiliation: Sanford-Burnham Medical Research Institute (SBMRI, San Diego, C...
In DepthDetails PCBioAssay