BDBM50309585 CHEMBL599678::N-(3,4-dihydroxyphenethyl)-4,5-dimethylfuran-2-carboxamide::cid_25199545
SMILES Cc1cc(oc1C)C(=O)NCCc1ccc(O)c(O)c1
InChI Key InChIKey=WJDKMPMCRDGFHG-UHFFFAOYSA-N
Data  3 IC50
  Tab Delimited (TSV)   2D SDfile   Computed 3D by Vconf -m prep SDfile
Find this compound or compounds like it in BindingDB:
Activity Spreadsheet -- Enzyme Inhibition Constant Data from BindingDB
Found 3 hits for monomerid = 50309585
TargetAlkaline phosphatase, tissue-nonspecific isozyme(Homo sapiens (Human))
Burnham Center For Chemical Genomics
Curated by PubChem BioAssay
LigandPNGBDBM50309585(CHEMBL599678 | N-(3,4-dihydroxyphenethyl)-4,5-dime...)
Affinity DataIC50:  5.73E+4nM. Assay description: Sanford-Burnham Center for Chemical Genomics (SBCCG) Sanford-Burnham Medical Research Institute (SBMRI, San Diego, CA) NIH Molecular Libraries Screen...
In DepthDetails PCBioAssay
TargetPhospholipase A-2-activating protein(Homo sapiens (Human))
Human Biomolecular Research Institute
Curated by ChEMBL
LigandPNGBDBM50309585(CHEMBL599678 | N-(3,4-dihydroxyphenethyl)-4,5-dime...)
Affinity DataIC50: >1.00E+5nM. Assay description: Inhibition of PLAP by analogous luminescence assay
In DepthDetails ArticlePubMed
TargetAlkaline phosphatase, germ cell type(Homo sapiens (Human))
Burnham Center For Chemical Genomics
Curated by PubChem BioAssay
LigandPNGBDBM50309585(CHEMBL599678 | N-(3,4-dihydroxyphenethyl)-4,5-dime...)
Affinity DataIC50: >1.00E+5nM. Assay description: Data Source: Sanford-Burnham Center for Chemical Genomics (SBCCG) Source Affiliation: Sanford-Burnham Medical Research Institute (SBMRI, San Diego, C...
In DepthDetails PCBioAssay