BDBM50309641 1-benzyl-3-(4-(5-chlorobenzo[d]oxazol-2-yl)phenyl)urea::CHEMBL598765
SMILES Clc1ccc2oc(nc2c1)-c1ccc(NC(=O)NCc2ccccc2)cc1
InChI Key InChIKey=WQNDAGAMUNDEQE-UHFFFAOYSA-N
Data  1 IC50
  Tab Delimited (TSV)   2D SDfile   Computed 3D by Vconf -m prep SDfile
Find this compound or compounds like it in BindingDB:
Activity Spreadsheet -- Enzyme Inhibition Constant Data from BindingDB
Found 1 hit for monomerid = 50309641
TargetCholesteryl ester transfer protein(Homo sapiens (Human))
Merck Research Laboratories
Curated by ChEMBL
LigandPNGBDBM50309641(1-benzyl-3-(4-(5-chlorobenzo[d]oxazol-2-yl)phenyl)...)
Affinity DataIC50: >3.00E+4nM. Assay description: Inhibition of CETP assessed as cholesteryl ester transfer activity
In DepthDetails ArticlePubMed