BDBM50311261 CHEMBL4173925
SMILES COc1ccc2n(cc(C(=O)Nc3cc(cc(c3)-c3ccco3)C(O)=O)c2c1)C(C)=O
InChI Key InChIKey=KOIBWAYWUHFAPT-UHFFFAOYSA-N
Data  8 IC50
  Tab Delimited (TSV)   2D SDfile   Computed 3D by Vconf -m prep SDfile
Find this compound or compounds like it in BindingDB:
Activity Spreadsheet -- Enzyme Inhibition Constant Data from BindingDB
Found 8 hits for monomerid = 50311261
TargetBromodomain-containing protein 9(Homo sapiens (Human))
Guangzhou Medical University
Curated by ChEMBL
LigandPNGBDBM50311261(CHEMBL4173925)
Affinity DataIC50: >2.00E+4nM. Assay description: Inhibition of biotinylated-H4KAc4 binding to human His6-tagged BRD9 (L14 to Q134 residues) expressed in Escherichia coli BL21(DE3) after 2.5 hrs by l...
In DepthDetails ArticlePubMed
TargetBromodomain-containing protein 4(Homo sapiens (Human))
Guangzhou Medical University
Curated by ChEMBL
LigandPNGBDBM50311261(CHEMBL4173925)
Affinity DataIC50: >2.00E+4nM. Assay description: Inhibition of biotinylated-H4KAc4 binding to human His6-tagged BRD4 bromodomain-1 (N44 to E168 residues) expressed in Escherichia coli BL21(DE3) afte...
In DepthDetails ArticlePubMed
TargetHistone acetyltransferase KAT2B(Homo sapiens (Human))
Guangzhou Medical University
Curated by ChEMBL
LigandPNGBDBM50311261(CHEMBL4173925)
Affinity DataIC50: >2.00E+4nM. Assay description: Inhibition of biotinylated-H4KAc4 binding to human His6-tagged PCAF (G715 to D831 residues) expressed in Escherichia coli BL21(DE3) after 2.5 hrs by ...
In DepthDetails ArticlePubMed
TargetCREB-binding protein(Homo sapiens (Human))
Guangzhou Medical University
Curated by ChEMBL
LigandPNGBDBM50311261(CHEMBL4173925)
Affinity DataIC50:  140nM. Assay description: Inhibition of biotinylated-H4KAc4 binding to human His6-tagged CBP (R1081 to G1197 residues) expressed in Escherichia coli BL21(DE3) after 2.5 hrs by...
In DepthDetails ArticlePubMed
TargetTranscription initiation factor TFIID subunit 1(Homo sapiens (Human))
Guangzhou Medical University
Curated by ChEMBL
LigandPNGBDBM50311261(CHEMBL4173925)
Affinity DataIC50: >2.00E+4nM. Assay description: Inhibition of biotinylated-H4KAc4 binding to human His6-tagged TAF-1 (R1377 to D1503 residues) expressed in Escherichia coli BL21(DE3) after 2.5 hrs ...
In DepthDetails ArticlePubMed
TargetBromodomain adjacent to zinc finger domain protein 2B(Homo sapiens (Human))
Guangzhou Medical University
Curated by ChEMBL
LigandPNGBDBM50311261(CHEMBL4173925)
Affinity DataIC50:  1.22E+4nM. Assay description: Inhibition of biotinylated-H4KAc4 binding to human His6-tagged BAZ2B (S1858 to S1972 residues) expressed in Escherichia coli BL21(DE3) after 2.5 hrs ...
In DepthDetails ArticlePubMed
TargetTranscription intermediary factor 1-alpha(Homo sapiens (Human))
Guangzhou Medical University
Curated by ChEMBL
LigandPNGBDBM50311261(CHEMBL4173925)
Affinity DataIC50: >2.00E+4nM. Assay description: Inhibition of biotinylated-H4KAc4 binding to human His6-tagged TIF-1 (G896 to E1014 residues) expressed in Escherichia coli BL21(DE3) after 2.5 hrs b...
In DepthDetails ArticlePubMed
TargetHistone acetyltransferase p300(Homo sapiens (Human))
Guangzhou Medical University
Curated by ChEMBL
LigandPNGBDBM50311261(CHEMBL4173925)
Affinity DataIC50:  1.78E+3nM. Assay description: Inhibition of biotinylated-H4KAc4 binding to human His6-tagged EP300 (A1040 to G1161 residues) expressed in Escherichia coli BL21(DE3) after 2.5 hrs ...
In DepthDetails ArticlePubMed