BDBM50311281 3,4'-(1H-1,2,4-triazole-3,5-diyl)dipyridine::CHEMBL1077387
SMILES c1cncc(c1)-c1nnc([nH]1)-c1ccncc1
InChI Key InChIKey=WIHUWTSKKGOEGI-UHFFFAOYSA-N
Data  1 IC50
  Tab Delimited (TSV)   2D SDfile   Computed 3D by Vconf -m prep SDfile
Find this compound or compounds like it in BindingDB:
Activity Spreadsheet -- Enzyme Inhibition Constant Data from BindingDB
Found 1 hit for monomerid = 50311281
TargetXanthine dehydrogenase/oxidase(Bos taurus (Bovine))
Fuji Yakuhin
Curated by ChEMBL
LigandPNGBDBM50311281(3,4'-(1H-1,2,4-triazole-3,5-diyl)dipyridine | CHEM...)
Affinity DataIC50:  130nM. Assay description: Inhibition of bovine milk XOR-mediated uric acid formation after 15 mins by spectrophotometer
In DepthDetails ArticlePubMed