BDBM50312249 CHEMBL1080201::difluoro(4-(3-fluorophenylcarbamoyl)phenyl)methylphosphonic acid
SMILES OP(O)(=O)C(F)(F)c1ccc(cc1)C(=O)Nc1cccc(F)c1
InChI Key InChIKey=SUBCAAGAAFTTDZ-UHFFFAOYSA-N
Data  1 KI
  Tab Delimited (TSV)   2D SDfile   Computed 3D by Vconf -m prep SDfile
Find this compound or compounds like it in BindingDB:
Activity Spreadsheet -- Enzyme Inhibition Constant Data from BindingDB
Found 1 hit for monomerid = 50312249
TargetLow molecular weight protein-tyrosine phosphatase A(Mycobacterium tuberculosis)
University Of California
Curated by ChEMBL
LigandPNGBDBM50312249(CHEMBL1080201 | difluoro(4-(3-fluorophenylcarbamoy...)
Affinity DataKi:  4.18E+4nM. Assay description: Inhibition of Mycobacterium tuberculosis PtpA
In DepthDetails ArticlePubMed