BDBM50314452 (S)-N-((S)-1-cyclohexyl-2-oxo-2-((S)-2-(4-(quinolin-4-yl)thiazol-2-yl)pyrrolidin-1-yl)ethyl)-2-(methylamino)propanamide::CHEMBL1089398
SMILES CN[C@@H](C)C(=O)N[C@@H](C1CCCCC1)C(=O)N1CCC[C@H]1c1nc(cs1)-c1ccnc2ccccc12
InChI Key InChIKey=GXPYWYRUTUBCTI-WDNCENIBSA-N
Data  2 KI
  Tab Delimited (TSV)   2D SDfile   Computed 3D by Vconf -m prep SDfile
Find this compound or compounds like it in BindingDB:
Activity Spreadsheet -- Enzyme Inhibition Constant Data from BindingDB
Found 2 hits for monomerid = 50314452
TargetBaculoviral IAP repeat-containing protein 7(Homo sapiens (Human))
Genentech
Curated by ChEMBL
LigandPNGBDBM50314452((S)-N-((S)-1-cyclohexyl-2-oxo-2-((S)-2-(4-(quinoli...)
Affinity DataKi:  4.50E+4nM. Assay description: Antagonist activity at ML-IAP MLXBIR3SG domain by fluorescence polarization assay ... On Thursday, November 10, 2011 9:19 AM from cohen.fred@gene.com...Checked by Author
In DepthDetails ArticlePubMed
TargetE3 ubiquitin-protein ligase XIAP(Homo sapiens (Human))
Genentech
Curated by ChEMBL
LigandPNGBDBM50314452((S)-N-((S)-1-cyclohexyl-2-oxo-2-((S)-2-(4-(quinoli...)
Affinity DataKi:  7.50E+4nM. Assay description: Antagonist activity at XIAP BIR3 domain by fluorescence polarization assay ... On Thursday, November 10, 2011 9:19 AM from cohen.fred@gene.com: Unfor...Checked by Author
In DepthDetails ArticlePubMed