BDBM50314592 CHEMBL1092461::N-(3-chloro-4-(4-ethylpiperazin-1-yl)phenyl)-4-methylbenzamide
SMILES CCN1CCN(CC1)c1ccc(NC(=O)c2ccc(C)cc2)cc1Cl
InChI Key InChIKey=UPEXLJSFWIFHBM-UHFFFAOYSA-N
Data  5 IC50
  Tab Delimited (TSV)   2D SDfile   Computed 3D by Vconf -m prep SDfile
Find this compound or compounds like it in BindingDB:
Activity Spreadsheet -- Enzyme Inhibition Constant Data from BindingDB
Found 5 hits for monomerid = 50314592
TargetMuscarinic acetylcholine receptor M1(Homo sapiens (Human))
Vanderbilt University Medical Center
Curated by ChEMBL
LigandPNGBDBM50314592(CHEMBL1092461 | N-(3-chloro-4-(4-ethylpiperazin-1-...)
Affinity DataIC50:  2.90E+3nM. Assay description: Antagonist activity at human muscarinic M1 receptor expressed in CHO-K1 cells assessed as inhibition of acetylcholine-induced calcium mobilization
In DepthDetails ArticlePubMed
TargetMuscarinic acetylcholine receptor M2(Homo sapiens (Human))
Vanderbilt University Medical Center
Curated by ChEMBL
LigandPNGBDBM50314592(CHEMBL1092461 | N-(3-chloro-4-(4-ethylpiperazin-1-...)
Affinity DataIC50:  6.90E+3nM. Assay description: Antagonist activity at human muscarinic M2 receptor expressed in CHO-K1 cells coexpressing Gqi5 chimeric G-protein assessed as inhibition of acetylch...
In DepthDetails ArticlePubMed
TargetMuscarinic acetylcholine receptor M5(Homo sapiens (Human))
Vanderbilt University Medical Center
Curated by ChEMBL
LigandPNGBDBM50314592(CHEMBL1092461 | N-(3-chloro-4-(4-ethylpiperazin-1-...)
Affinity DataIC50: >1.00E+4nM. Assay description: Antagonist activity at human muscarinic M5 receptor expressed in CHO-K1 cells assessed as inhibition of acetylcholine-induced calcium mobilization
In DepthDetails ArticlePubMed
TargetMuscarinic acetylcholine receptor M4(Homo sapiens (Human))
Vanderbilt University Medical Center
Curated by ChEMBL
LigandPNGBDBM50314592(CHEMBL1092461 | N-(3-chloro-4-(4-ethylpiperazin-1-...)
Affinity DataIC50:  3.70E+3nM. Assay description: Antagonist activity at human muscarinic M4 receptor expressed in CHO-K1 cells coexpressing Gqi5 chimeric G-protein assessed as inhibition of acetylch...
In DepthDetails ArticlePubMed
TargetMuscarinic acetylcholine receptor M3(Homo sapiens (Human))
Vanderbilt University Medical Center
Curated by ChEMBL
LigandPNGBDBM50314592(CHEMBL1092461 | N-(3-chloro-4-(4-ethylpiperazin-1-...)
Affinity DataIC50: >1.00E+4nM. Assay description: Antagonist activity at human muscarinic M3 receptor expressed in CHO-K1 cells assessed as inhibition of acetylcholine-induced calcium mobilization
In DepthDetails ArticlePubMed