BDBM50316113 2-Allylthio-3-benzyl-6-cinnamylamino-quinazolin-4(3H)-one::CHEMBL1093993
SMILES C=CCSc1nc2ccc(NC\C=C\c3ccccc3)cc2c(=O)n1Cc1ccccc1
InChI Key InChIKey=NIJWKWFNQMAKSU-NTEUORMPSA-N
Data  2 IC50
  Tab Delimited (TSV)   2D SDfile   Computed 3D by Vconf -m prep SDfile
Find this compound or compounds like it in BindingDB:
Activity Spreadsheet -- Enzyme Inhibition Constant Data from BindingDB
Found 2 hits for monomerid = 50316113
TargetDihydrofolate reductase(Homo sapiens (Human))
King Saud University
Curated by ChEMBL
LigandPNGBDBM50316113(2-Allylthio-3-benzyl-6-cinnamylamino-quinazolin-4(...)
Affinity DataIC50:  3.00E+3nM. Assay description: Inhibition of human DHFR after 2 mins
In DepthDetails ArticlePubMed
TargetDihydrofolate reductase(Bos taurus (Cattle))
King Saud University
Curated by ChEMBL
LigandPNGBDBM50316113(2-Allylthio-3-benzyl-6-cinnamylamino-quinazolin-4(...)
Affinity DataIC50:  5.00E+3nM. Assay description: Inhibition of bovine DHFR after 2 mins
In DepthDetails ArticlePubMed