BDBM50316114 3-Benzyl-6-dicinnamylamino-2-methylthio-quinazolin-4(3H)-one::CHEMBL1090563
SMILES CSc1nc2ccc(cc2c(=O)n1Cc1ccccc1)N(C\C=C\c1ccccc1)C\C=C\c1ccccc1
InChI Key InChIKey=LCLSYSQRYKIUKX-AYKLPDECSA-N
Data  2 IC50
  Tab Delimited (TSV)   2D SDfile   Computed 3D by Vconf -m prep SDfile
Find this compound or compounds like it in BindingDB:
Activity Spreadsheet -- Enzyme Inhibition Constant Data from BindingDB
Found 2 hits for monomerid = 50316114
TargetDihydrofolate reductase(Homo sapiens (Human))
King Saud University
Curated by ChEMBL
LigandPNGBDBM50316114(3-Benzyl-6-dicinnamylamino-2-methylthio-quinazolin...)
Affinity DataIC50:  800nM. Assay description: Inhibition of human DHFR after 2 mins
In DepthDetails ArticlePubMed
TargetDihydrofolate reductase(Bos taurus (Cattle))
King Saud University
Curated by ChEMBL
LigandPNGBDBM50316114(3-Benzyl-6-dicinnamylamino-2-methylthio-quinazolin...)
Affinity DataIC50:  600nM. Assay description: Inhibition of bovine DHFR after 2 mins
In DepthDetails ArticlePubMed