BDBM50316121 CHEMBL1089229::N-(3-Benzyl-2-cinnamylthio-4-oxo-3,4-dihydroquinazolin-6-yl)-cinnamamide
SMILES O=C(Nc1ccc2nc(SC\C=C\c3ccccc3)n(Cc3ccccc3)c(=O)c2c1)\C=C\c1ccccc1
InChI Key InChIKey=JQRNOMHSFFHVKD-AETZCSFFSA-N
Data  2 IC50
  Tab Delimited (TSV)   2D SDfile   Computed 3D by Vconf -m prep SDfile
Find this compound or compounds like it in BindingDB:
Activity Spreadsheet -- Enzyme Inhibition Constant Data from BindingDB
Found 2 hits for monomerid = 50316121
TargetDihydrofolate reductase(Bos taurus (Cattle))
King Saud University
Curated by ChEMBL
LigandPNGBDBM50316121(CHEMBL1089229 | N-(3-Benzyl-2-cinnamylthio-4-oxo-3...)
Affinity DataIC50:  900nM. Assay description: Inhibition of bovine DHFR after 2 mins
In DepthDetails ArticlePubMed
TargetDihydrofolate reductase(Homo sapiens (Human))
King Saud University
Curated by ChEMBL
LigandPNGBDBM50316121(CHEMBL1089229 | N-(3-Benzyl-2-cinnamylthio-4-oxo-3...)
Affinity DataIC50:  500nM. Assay description: Inhibition of human DHFR after 2 mins
In DepthDetails ArticlePubMed