BDBM50316383 CHEMBL1097230::Ethyl-2-((S)-3-((S)-2-amino-4-methylpentanamido)-2,6-dioxopiperidin-1-yl)acetate hydrochloride
SMILES CCOC(=O)CN1C(=O)CC[C@H](NC(=O)[C@@H](N)CC(C)C)C1=O
InChI Key InChIKey=RABPUMWGKSOJGA-QWRGUYRKSA-N
Data  1 IC50
  Tab Delimited (TSV)   2D SDfile   Computed 3D by Vconf -m prep SDfile
Find this compound or compounds like it in BindingDB:
Activity Spreadsheet -- Enzyme Inhibition Constant Data from BindingDB
Found 1 hit for monomerid = 50316383
TargetAminopeptidase N(Homo sapiens (Human))
Shandong University
Curated by ChEMBL
LigandPNGBDBM50316383(CHEMBL1097230 | Ethyl-2-((S)-3-((S)-2-amino-4-meth...)
Affinity DataIC50:  3.08E+4nM. Assay description: Inhibition of aminopeptidase N
In DepthDetails ArticlePubMed