BDBM50316400 2-((S)-3-((S)-2-Amino-3-(4-hydroxyphenyl)propanamido)-2,6-dioxopiperidin-1-yl)acetic acid hydrochloride::CHEMBL1095255
SMILES N[C@@H](Cc1ccc(O)cc1)C(=O)N[C@H]1CCC(=O)N(CC(O)=O)C1=O
InChI Key InChIKey=OLSMMUQCFJDNPH-RYUDHWBXSA-N
Data  1 IC50
  Tab Delimited (TSV)   2D SDfile   Computed 3D by Vconf -m prep SDfile
Find this compound or compounds like it in BindingDB:
Activity Spreadsheet -- Enzyme Inhibition Constant Data from BindingDB
Found 1 hit for monomerid = 50316400
TargetAminopeptidase N(Homo sapiens (Human))
Shandong University
Curated by ChEMBL
LigandPNGBDBM50316400(2-((S)-3-((S)-2-Amino-3-(4-hydroxyphenyl)propanami...)
Affinity DataIC50:  1.13E+4nM. Assay description: Inhibition of aminopeptidase N
In DepthDetails ArticlePubMed