BDBM50316404 (S)-2-Amino-N-((S)-1-(2-(hydroxyamino)-2-oxoethyl)-2,6-dioxopiperidin-3-yl)-4-methylpentanamide hydrochloride::CHEMBL1098910
SMILES CC(C)C[C@H](N)C(=O)N[C@H]1CCC(=O)N(CC(=O)NO)C1=O
InChI Key InChIKey=PWNSECVUDWECNM-IUCAKERBSA-N
Data  1 IC50
  Tab Delimited (TSV)   2D SDfile   Computed 3D by Vconf -m prep SDfile
Find this compound or compounds like it in BindingDB:
Activity Spreadsheet -- Enzyme Inhibition Constant Data from BindingDB
Found 1 hit for monomerid = 50316404
TargetAminopeptidase N(Homo sapiens (Human))
Shandong University
Curated by ChEMBL
LigandPNGBDBM50316404((S)-2-Amino-N-((S)-1-(2-(hydroxyamino)-2-oxoethyl)...)
Affinity DataIC50:  5.30E+3nM. Assay description: Inhibition of aminopeptidase N
In DepthDetails ArticlePubMed