BDBM50316409 (S)-2-Amino-N-((S)-1-(2-(hydroxyamino)-2-oxoethyl)-2,6-dioxopiperidin-3-yl)-3-(4-hydroxyphenyl)propanamidehydrochloride::CHEMBL1095254
SMILES N[C@@H](Cc1ccc(O)cc1)C(=O)N[C@H]1CCC(=O)N(CC(=O)NO)C1=O
InChI Key InChIKey=UJHOFIRXVCLRJQ-RYUDHWBXSA-N
Data  1 IC50
  Tab Delimited (TSV)   2D SDfile   Computed 3D by Vconf -m prep SDfile
Find this compound or compounds like it in BindingDB:
Activity Spreadsheet -- Enzyme Inhibition Constant Data from BindingDB
Found 1 hit for monomerid = 50316409
TargetAminopeptidase N(Homo sapiens (Human))
Shandong University
Curated by ChEMBL
LigandPNGBDBM50316409((S)-2-Amino-N-((S)-1-(2-(hydroxyamino)-2-oxoethyl)...)
Affinity DataIC50:  7.30E+3nM. Assay description: Inhibition of aminopeptidase N
In DepthDetails ArticlePubMed