BDBM50316791 2-{5-(4-Hydroxyphenethoxy)-1-{5-[4-(methylthio)-phenyl]pentyl}-1H-indole-3-yl}ethanamine hydrochloride::CHEMBL1094194
SMILES CSc1ccc(CCCCCn2cc(CCN)c3cc(OCCc4ccc(O)cc4)ccc23)cc1
InChI Key InChIKey=KTYVAFOTAYILKZ-UHFFFAOYSA-N
Data  4 IC50
  Tab Delimited (TSV)   2D SDfile   Computed 3D by Vconf -m prep SDfile
Find this compound or compounds like it in BindingDB:
Activity Spreadsheet -- Enzyme Inhibition Constant Data from BindingDB
Found 4 hits for monomerid = 50316791
TargetVascular endothelial growth factor receptor 3(Homo sapiens (Human))
Universit£T Leipzig
Curated by ChEMBL
LigandPNGBDBM50316791(2-{5-(4-Hydroxyphenethoxy)-1-{5-[4-(methylthio)-ph...)
Affinity DataIC50:  2.53E+3nM. Assay description: Inhibition of VEGFR3 after 30 mins by chemiluminescence ELISA
In DepthDetails ArticlePubMed
TargetEpidermal growth factor receptor(Homo sapiens (Human))
Universit£T Leipzig
Curated by ChEMBL
LigandPNGBDBM50316791(2-{5-(4-Hydroxyphenethoxy)-1-{5-[4-(methylthio)-ph...)
Affinity DataIC50:  1.92E+3nM. Assay description: Inhibition of EGFR after 30 mins by chemiluminescence ELISA
In DepthDetails ArticlePubMed
TargetVascular endothelial growth factor receptor 2(Homo sapiens (Human))
Universit£T Leipzig
Curated by ChEMBL
LigandPNGBDBM50316791(2-{5-(4-Hydroxyphenethoxy)-1-{5-[4-(methylthio)-ph...)
Affinity DataIC50:  1.22E+3nM. Assay description: Noncompetitive inhibition of VEGFR2 after 30 mins by chemiluminescence ELISA in presence of 25 uM ATP
In DepthDetails ArticlePubMed
TargetInsulin-like growth factor 1 receptor(Homo sapiens (Human))
Universit£T Leipzig
Curated by ChEMBL
LigandPNGBDBM50316791(2-{5-(4-Hydroxyphenethoxy)-1-{5-[4-(methylthio)-ph...)
Affinity DataIC50:  2.25E+3nM. Assay description: Noncompetitive inhibition of IGF1R after 30 mins by chemiluminescence ELISA in presence of 50 uM ATP
In DepthDetails ArticlePubMed