BDBM50316941 (S)-2-(1-methylpiperidin-3-yl)-1-(pyridin-2-ylmethyl)-1H-benzo[d]imidazole::CHEMBL1095201
SMILES CN1CCC[C@@H](C1)c1nc2ccccc2n1Cc1ccccn1
InChI Key InChIKey=KYIVOBNKSGAKNZ-HNNXBMFYSA-N
Data  1 KI
  Tab Delimited (TSV)   2D SDfile   Computed 3D by Vconf -m prep SDfile
Find this compound or compounds like it in BindingDB:
Activity Spreadsheet -- Enzyme Inhibition Constant Data from BindingDB
Found 1 hit for monomerid = 50316941
TargetPotassium voltage-gated channel subfamily H member 2(Homo sapiens (Human))
Neurocrine Biosciences
Curated by ChEMBL
LigandPNGBDBM50316941((S)-2-(1-methylpiperidin-3-yl)-1-(pyridin-2-ylmeth...)
Affinity DataKi: >1.00E+4nM. Assay description: Displacement of [3H]dofetolide from human ERG channel expressed in HEK293 cells by liquid scintillation counting
In DepthDetails ArticlePubMed