BDBM50316943 (S)-1-(2-ethoxyethyl)-2-(1-methylpiperidin-3-yl)-1H-benzo[d]imidazole::CHEMBL1095199
SMILES CCOCCn1c(nc2ccccc12)[C@H]1CCCN(C)C1
InChI Key InChIKey=VWKIIEUSSJXADS-AWEZNQCLSA-N
Data  1 KI
  Tab Delimited (TSV)   2D SDfile   Computed 3D by Vconf -m prep SDfile
Find this compound or compounds like it in BindingDB:
Activity Spreadsheet -- Enzyme Inhibition Constant Data from BindingDB
Found 1 hit for monomerid = 50316943
TargetPotassium voltage-gated channel subfamily H member 2(Homo sapiens (Human))
Neurocrine Biosciences
Curated by ChEMBL
LigandPNGBDBM50316943((S)-1-(2-ethoxyethyl)-2-(1-methylpiperidin-3-yl)-1...)
Affinity DataKi: >1.00E+4nM. Assay description: Displacement of [3H]dofetolide from human ERG channel expressed in HEK293 cells by liquid scintillation counting
In DepthDetails ArticlePubMed