BDBM50318663 (1S,3R)-5'-Chloro-6,7-difluoro-3-methyl-2,3,4,9-tetrahydrospiro-[beta-carboline-1,3'-indol]-2'(1'H)-one::CHEMBL1086478
SMILES C[C@@H]1Cc2c([nH]c3cc(F)c(F)cc23)[C@]2(N1)C(=O)Nc1ccc(Cl)cc21
InChI Key InChIKey=JZCVYBQWYSYJEA-YLVJLNSGSA-N
Data  1 IC50
  Tab Delimited (TSV)   2D SDfile   Computed 3D by Vconf -m prep SDfile
Find this compound or compounds like it in BindingDB:
Activity Spreadsheet -- Enzyme Inhibition Constant Data from BindingDB
Found 1 hit for monomerid = 50318663
TargetCytochrome P450 2C9(Homo sapiens (Human))
Novartis Institute For Tropical Diseases
Curated by ChEMBL
LigandPNGBDBM50318663((1S,3R)-5'-Chloro-6,7-difluoro-3-methyl-2,3,4,9-te...)
Affinity DataIC50: >1.00E+4nM. Assay description: Inhibition of CYP2C9 in human liver microsome by LC-MS/MS analysis
In DepthDetails ArticlePubMed