BDBM50319470 1-(2-(3-fluoro-3-methylbutyl)-4-(trifluoromethyl)benzyl)-3-(1H-indazol-4-yl)urea::CHEMBL1086277
SMILES CC(C)(F)CCc1cc(ccc1CNC(=O)Nc1cccc2[nH]ncc12)C(F)(F)F
InChI Key InChIKey=OUZXVFKEKUTOBE-UHFFFAOYSA-N
Data  1 IC50
  Tab Delimited (TSV)   2D SDfile   Computed 3D by Vconf -m prep SDfile
Find this compound or compounds like it in BindingDB:
Activity Spreadsheet -- Enzyme Inhibition Constant Data from BindingDB
Found 1 hit for monomerid = 50319470
TargetTransient receptor potential cation channel subfamily V member 1(Homo sapiens (Human))
Abbott Laboratories
Curated by ChEMBL
LigandPNGBDBM50319470(1-(2-(3-fluoro-3-methylbutyl)-4-(trifluoromethyl)b...)
Affinity DataIC50:  6nM. Assay description: Antagonist activity at human TRPV1
In DepthDetails ArticlePubMed