BDBM50319707 CHEMBL1083276::rac-N-(7-chloro-1-oxo-1,2-dihydroisoquinolin-6-yl)-4-(3-(trifluoromethyl)phenyl)pyrrolidine-3-carboxamide
SMILES FC(F)(F)c1cccc(c1)C1CNCC1C(=O)Nc1cc2cc[nH]c(=O)c2cc1Cl
InChI Key InChIKey=YTLDKYRSLDUIMH-UHFFFAOYSA-N
Data  1 IC50
  Tab Delimited (TSV)   2D SDfile   Computed 3D by Vconf -m prep SDfile
Find this compound or compounds like it in BindingDB:
Activity Spreadsheet -- Enzyme Inhibition Constant Data from BindingDB
Found 1 hit for monomerid = 50319707
TargetRho-associated protein kinase 2(Homo sapiens (Human))
Boehringer Ingelheim Pharmaceuticals
Curated by ChEMBL
LigandPNGBDBM50319707(CHEMBL1083276 | rac-N-(7-chloro-1-oxo-1,2-dihydroi...)
Affinity DataIC50:  4nM. Assay description: Inhibition of ROCK2 by luciferase based ATP detection assay
In DepthDetails ArticlePubMed