BDBM50320770 5-Acetamido-2,6-anhydro-4-[N-(3-piperazinocarbonyl)propyl]guanidino-3,4,5-trideoxy-D-glycero-D-galacto-non-2-enonic acid::CHEMBL1165529
SMILES CC(=O)N[C@H]1[C@@H](OC(=C[C@@H]1N(CCCC(=O)N1CCNCC1)C(N)=N)C(O)=O)[C@H](O)[C@H](O)CO
InChI Key InChIKey=WFADZALWQKQQCG-NYMASUJMSA-N
Data  1 IC50
  Tab Delimited (TSV)   2D SDfile   Computed 3D by Vconf -m prep SDfile
Find this compound or compounds like it in BindingDB:
Activity Spreadsheet -- Enzyme Inhibition Constant Data from BindingDB
Found 1 hit for monomerid = 50320770
TargetNeuraminidase(Influenza A virus)
National Taiwan University
Curated by ChEMBL
LigandPNGBDBM50320770(5-Acetamido-2,6-anhydro-4-[N-(3-piperazinocarbonyl...)
Affinity DataIC50:  2.15E+3nM. Assay description: Inhibition of Influenza A virus A/WSN/1933(H1N1) neuraminidase
In DepthDetails ArticlePubMed