BDBM50321480 (6-(3-chlorophenoxy)pyridin-3-yl)(4-isopropylpiperazin-1-yl)methanone::CHEMBL1170580
SMILES CC(C)N1CCN(CC1)C(=O)c1ccc(Oc2cccc(Cl)c2)nc1
InChI Key InChIKey=XLMIUBHBSRXMGN-UHFFFAOYSA-N
Data  1 KI
  Tab Delimited (TSV)   2D SDfile   Computed 3D by Vconf -m prep SDfile
Find this compound or compounds like it in BindingDB:
Activity Spreadsheet -- Enzyme Inhibition Constant Data from BindingDB
Found 1 hit for monomerid = 50321480
TargetHistamine H3 receptor(Homo sapiens (Human))
Johnson & Johnson Pharmaceutical Research & Development
Curated by ChEMBL
LigandPNGBDBM50321480((6-(3-chlorophenoxy)pyridin-3-yl)(4-isopropylpiper...)
Affinity DataKi:  100nM. Assay description: Displacement of [125I]-iodoproxyfan from human recombinant histamine H3 receptor expressed in human SK-N-MC cells after 1 hr by scintillation countin...
In DepthDetails ArticlePubMed