BDBM50323301 3-cyano-N-(6-ethylpyridin-2-yl)-5-fluorobenzamide::CHEMBL1209330
SMILES CCc1cccc(NC(=O)c2cc(F)cc(c2)C#N)n1
InChI Key InChIKey=LBPUNEZWEHBQQO-UHFFFAOYSA-N
Data  1 KI  2 IC50
  Tab Delimited (TSV)   2D SDfile   Computed 3D by Vconf -m prep SDfile
Find this compound or compounds like it in BindingDB:
Activity Spreadsheet -- Enzyme Inhibition Constant Data from BindingDB
Found 3 hits for monomerid = 50323301
TargetMetabotropic glutamate receptor 5(Rattus norvegicus (Rat))
National Institute On Drug Abuse-Intramural Research Program
Curated by ChEMBL
LigandPNGBDBM50323301(3-cyano-N-(6-ethylpyridin-2-yl)-5-fluorobenzamide ...)
Affinity DataKi:  762nM. Assay description: Displacement of [3H]-MPEP from mGluR5 in rat brain
In DepthDetails ArticlePubMed
TargetMetabotropic glutamate receptor 5(Rattus norvegicus (Rat))
National Institute On Drug Abuse-Intramural Research Program
Curated by ChEMBL
LigandPNGBDBM50323301(3-cyano-N-(6-ethylpyridin-2-yl)-5-fluorobenzamide ...)
Affinity DataIC50:  169nM. Assay description: Antagonist activity at rat mGluR5 expressed in HEK293T cells assessed as inhibition of glutamate-induced calcium flux by calcium fluorescence assay
In DepthDetails ArticlePubMed
TargetMetabotropic glutamate receptor 5(Rattus norvegicus (Rat))
National Institute On Drug Abuse-Intramural Research Program
Curated by ChEMBL
LigandPNGBDBM50323301(3-cyano-N-(6-ethylpyridin-2-yl)-5-fluorobenzamide ...)
Affinity DataIC50:  505nM. Assay description: Antagonist activity at rat mGlu5 receptor expressed in HEK293A cells assessed as inhibition of glutamate-induced calcium mobilization
In DepthDetails ArticlePubMed