BDBM50323684 CHEMBL1209306::rac-exo-[6-(2-(5-Carboxamidopyridin-3-yl)phenoxy))]-3-azabicyclo[3.2.1]octane hydrochloride
SMILES NC(=O)c1cncc(c1)-c1ccccc1O[C@H]1C[C@H]2C[C@@H]1CNC2
InChI Key InChIKey=OUHSMVDDOPDHGW-DFHBCGBQSA-N
Data  2 KI
  Tab Delimited (TSV)   2D SDfile   Computed 3D by Vconf -m prep SDfile
Find this compound or compounds like it in BindingDB:
Activity Spreadsheet -- Enzyme Inhibition Constant Data from BindingDB
Found 2 hits for monomerid = 50323684
TargetNeuronal acetylcholine receptor subunit alpha-4/beta-2(Homo sapiens (Human))
Pfizer
Curated by ChEMBL
LigandPNGBDBM50323684(CHEMBL1209306 | rac-exo-[6-(2-(5-Carboxamidopyridi...)
Affinity DataKi: >963nM. Assay description: Displacement of [3H]epibatidine from alpha4beta2 nicotinic receptor expressed in human HEK293 cells
In DepthDetails ArticlePubMed
TargetNeuronal acetylcholine receptor subunit alpha-7(Homo sapiens (Human))
Pfizer
Curated by ChEMBL
LigandPNGBDBM50323684(CHEMBL1209306 | rac-exo-[6-(2-(5-Carboxamidopyridi...)
Affinity DataKi: >1.50E+4nM. Assay description: Displacement of [3H]epibatidine from alpha7 nicotinic receptor expressed in human HEK293 cells
In DepthDetails ArticlePubMed