BDBM50324206 (+/-)-cis-2-(4-Cyanophenyl)-3-(4-fluorophenyl)-2,3,3a,4-tetrahydroindeno[1,2-c]pyrazole-6-carboxylic Acid::CHEMBL1215264
SMILES OC(=O)c1ccc2C3=NN([C@H]([C@H]3Cc2c1)c1ccc(F)cc1)c1ccc(cc1)C#N
InChI Key InChIKey=USLDHHOKRNNERD-GMAHTHKFSA-N
Data  1 IC50
  Tab Delimited (TSV)   2D SDfile   Computed 3D by Vconf -m prep SDfile
Find this compound or compounds like it in BindingDB:
Activity Spreadsheet -- Enzyme Inhibition Constant Data from BindingDB
Found 1 hit for monomerid = 50324206
TargetMineralocorticoid receptor(Homo sapiens (Human))
Pfizer
Curated by ChEMBL
LigandPNGBDBM50324206((+/-)-cis-2-(4-Cyanophenyl)-3-(4-fluorophenyl)-2,3...)
Affinity DataIC50:  4.34E+3nM. Assay description: Antagonist activity at Gal4-tagged mineralocorticoid receptor expressed in human Huh7 cells by luciferase reporter gene assay
In DepthDetails ArticlePubMed