BDBM50324644 6-(4-Methoxy-3,5-dimethyl-phenyl)-4-oxo-1-pentyl-1,4-dihydro-quinoline-3-carboxylic acid adamantan-1-ylamide::CHEMBL1215898
SMILES CCCCCn1cc(C(=O)NC23CC4CC(CC(C4)C2)C3)c(=O)c2cc(ccc12)-c1cc(C)c(OC)c(C)c1
InChI Key InChIKey=FKDWSRCLKCUSQQ-UHFFFAOYSA-N
Data  4 KI
  Tab Delimited (TSV)   2D SDfile   Computed 3D by Vconf -m prep SDfile
Find this compound or compounds like it in BindingDB:
Activity Spreadsheet -- Enzyme Inhibition Constant Data from BindingDB
Found 4 hits for monomerid = 50324644
TargetCannabinoid receptor 2(Homo sapiens (Human))
Universit£
Curated by ChEMBL
LigandPNGBDBM50324644(6-(4-Methoxy-3,5-dimethyl-phenyl)-4-oxo-1-pentyl-1...)
Affinity DataKi:  21.5nM. Assay description: Displacement of [3H]CP 55940 from human CB2 receptor in cell free system
In DepthDetails ArticlePubMed
TargetCannabinoid receptor 2(Homo sapiens (Human))
Universit£
Curated by ChEMBL
LigandPNGBDBM50324644(6-(4-Methoxy-3,5-dimethyl-phenyl)-4-oxo-1-pentyl-1...)
Affinity DataKi:  21.5nM. Assay description: Displacement of [3H]CP-55940 from human CB2 receptor expressed in HEK cells
In DepthDetails ArticlePubMed
TargetCannabinoid receptor 1(Homo sapiens (Human))
Universit£
Curated by ChEMBL
LigandPNGBDBM50324644(6-(4-Methoxy-3,5-dimethyl-phenyl)-4-oxo-1-pentyl-1...)
Affinity DataKi:  510nM. Assay description: Displacement of [3H]CP-55940 from human CB1 receptor expressed in HEK cells
In DepthDetails ArticlePubMed
TargetCannabinoid receptor 1(Homo sapiens (Human))
Universit£
Curated by ChEMBL
LigandPNGBDBM50324644(6-(4-Methoxy-3,5-dimethyl-phenyl)-4-oxo-1-pentyl-1...)
Affinity DataKi:  510nM. Assay description: Displacement of [3H]CP 55940 from human CB1 receptor in cell free system
In DepthDetails ArticlePubMed