BDBM50324659 6-Bromo-4-oxo-1-pentyl-N-(piperidin-1-yl)-1,4-dihydroquinoline-3-carboxamide::CHEMBL1215992
SMILES CCCCCn1cc(C(=O)NN2CCCCC2)c(=O)c2cc(Br)ccc12
InChI Key InChIKey=AKOBEJUBLNQHMO-UHFFFAOYSA-N
Data  2 KI
  Tab Delimited (TSV)   2D SDfile   Computed 3D by Vconf -m prep SDfile
Find this compound or compounds like it in BindingDB:
Activity Spreadsheet -- Enzyme Inhibition Constant Data from BindingDB
Found 2 hits for monomerid = 50324659
TargetCannabinoid receptor 2(Homo sapiens (Human))
Universit£
Curated by ChEMBL
LigandPNGBDBM50324659(6-Bromo-4-oxo-1-pentyl-N-(piperidin-1-yl)-1,4-dihy...)
Affinity DataKi:  400nM. Assay description: Displacement of [3H]CP-55940 from human CB2 receptor expressed in HEK cells
In DepthDetails ArticlePubMed
TargetCannabinoid receptor 1(Homo sapiens (Human))
Universit£
Curated by ChEMBL
LigandPNGBDBM50324659(6-Bromo-4-oxo-1-pentyl-N-(piperidin-1-yl)-1,4-dihy...)
Affinity DataKi:  1.90E+3nM. Assay description: Displacement of [3H]CP-55940 from human CB1 receptor expressed in HEK cells
In DepthDetails ArticlePubMed