BDBM50326333 5-chloro-2-(4-nitrophenoxy)phenol::CHEMBL1240784
SMILES Oc1cc(Cl)ccc1Oc1ccc(cc1)[N+]([O-])=O
InChI Key InChIKey=KVYQMQPIAUECHP-UHFFFAOYSA-N
Data  1 IC50
  Tab Delimited (TSV)   2D SDfile   Computed 3D by Vconf -m prep SDfile
Find this compound or compounds like it in BindingDB:
Activity Spreadsheet -- Enzyme Inhibition Constant Data from BindingDB
Found 1 hit for monomerid = 50326333
TargetEnoyl-acyl carrier reductase ENR(Toxoplasma gondii)
University Of Illinois At Chicago
Curated by ChEMBL
LigandPNGBDBM50326333(5-chloro-2-(4-nitrophenoxy)phenol | CHEMBL1240784)
Affinity DataIC50:  130nM. Assay description: Inhibition of Toxoplasma gondii enoyl reductase
In DepthDetails ArticlePubMed