BDBM50326403 (+/-)-trans-4-Cyclopentyl-1-[(9-deazaadenin-9-yl)methyl]-3-hydroxypyrrolidine::CHEMBL1243279
SMILES Nc1ncnc2c(CN3C[C@H](O)[C@H](C3)C3CCCC3)c[nH]c12
InChI Key InChIKey=JLVRXMKNZWZPTP-OLZOCXBDSA-N
Data  1 KI
  Tab Delimited (TSV)   2D SDfile   Computed 3D by Vconf -m prep SDfile
Find this compound or compounds like it in BindingDB:
Activity Spreadsheet -- Enzyme Inhibition Constant Data from BindingDB
Found 1 hit for monomerid = 50326403
TargetS-methyl-5'-thioadenosine phosphorylase(Homo sapiens (Human))
Industrial Research
Curated by ChEMBL
LigandPNGBDBM50326403((+/-)-trans-4-Cyclopentyl-1-[(9-deazaadenin-9-yl)m...)
Affinity DataKi:  2.60nM. Assay description: Inhibition of His-tagged human MTAP
In DepthDetails ArticlePubMed