BDBM50326407 (+/-)-trans-4-Allyl-1-[(9-deazaadenin-9-yl)methyl]-3-hydroxypyrrolidine::CHEMBL1240542
SMILES Nc1ncnc2c(CN3C[C@H](O)[C@@H](CC=C)C3)c[nH]c12
InChI Key InChIKey=ODBPJJXCZYWWCZ-ONGXEEELSA-N
Data  1 KI
  Tab Delimited (TSV)   2D SDfile   Computed 3D by Vconf -m prep SDfile
Find this compound or compounds like it in BindingDB:
Activity Spreadsheet -- Enzyme Inhibition Constant Data from BindingDB
Found 1 hit for monomerid = 50326407
TargetS-methyl-5'-thioadenosine phosphorylase(Homo sapiens (Human))
Industrial Research
Curated by ChEMBL
LigandPNGBDBM50326407((+/-)-trans-4-Allyl-1-[(9-deazaadenin-9-yl)methyl]...)
Affinity DataKi:  3nM. Assay description: Inhibition of His-tagged human MTAP
In DepthDetails ArticlePubMed