BDBM50326453 3-(Benzyloxy)-3',4',5'-trimethoxybiphenyl-4-carbaldehyde::CHEMBL1243130
SMILES COc1cc(cc(OC)c1OC)-c1ccc(C=O)c(OCc2ccccc2)c1
InChI Key InChIKey=UBCOJBUKLOVVJJ-UHFFFAOYSA-N
Data  1 IC50
  Tab Delimited (TSV)   2D SDfile   Computed 3D by Vconf -m prep SDfile
Find this compound or compounds like it in BindingDB:
Activity Spreadsheet -- Enzyme Inhibition Constant Data from BindingDB
Found 1 hit for monomerid = 50326453
TargetPolyphenol oxidase 2(Agaricus bisporus (Common mushroom))
Jinan University
Curated by ChEMBL
LigandPNGBDBM50326453(3-(Benzyloxy)-3',4',5'-trimethoxybiphenyl-4-carbal...)
Affinity DataIC50: >2.00E+6nM. Assay description: Inhibition of mushroom tyrosinase after 30 mins
In DepthDetails ArticlePubMed