BDBM50326454 CHEMBL1243377::N-Benzyl-4'-hydroxy-3',5'-dimethoxybiphenyl-4-carboxamide
SMILES COc1cc(cc(OC)c1O)-c1ccc(cc1)C(=O)NCc1ccccc1
InChI Key InChIKey=LGXXZMGEHMLIPX-UHFFFAOYSA-N
Data  1 IC50
  Tab Delimited (TSV)   2D SDfile   Computed 3D by Vconf -m prep SDfile
Find this compound or compounds like it in BindingDB:
Activity Spreadsheet -- Enzyme Inhibition Constant Data from BindingDB
Found 1 hit for monomerid = 50326454
TargetPolyphenol oxidase 2(Agaricus bisporus (Common mushroom))
Jinan University
Curated by ChEMBL
LigandPNGBDBM50326454(CHEMBL1243377 | N-Benzyl-4'-hydroxy-3',5'-dimethox...)
Affinity DataIC50:  1.20E+5nM. Assay description: Inhibition of mushroom tyrosinase after 30 mins
In DepthDetails ArticlePubMed