BDBM50326460 1-(4'-Hydroxy-3',5',6-trimethoxybiphenyl-3-yl)ethanone::CHEMBL1243342
SMILES COc1cc(cc(OC)c1O)-c1cc(ccc1OC)C(C)=O
InChI Key InChIKey=LDGOIBFITSTUDN-UHFFFAOYSA-N
Data  1 IC50
  Tab Delimited (TSV)   2D SDfile   Computed 3D by Vconf -m prep SDfile
Find this compound or compounds like it in BindingDB:
Activity Spreadsheet -- Enzyme Inhibition Constant Data from BindingDB
Found 1 hit for monomerid = 50326460
TargetPolyphenol oxidase 2(Agaricus bisporus (Common mushroom))
Jinan University
Curated by ChEMBL
LigandPNGBDBM50326460(1-(4'-Hydroxy-3',5',6-trimethoxybiphenyl-3-yl)etha...)
Affinity DataIC50:  1.40E+5nM. Assay description: Inhibition of mushroom tyrosinase after 30 mins
In DepthDetails ArticlePubMed